{"text_format":"1","workbook":"xlsx","n_sheets":30,"sheets":["param","komite","Main","resid","rahnama","moshakhasat","tahsilat","sanavat","rotbe","arzeshyabi","a","b1","b2","b3","g1-1","g1-2","g2-1","g2-2","g3","g4","d1","d2","d3","d4","d5","d8","d9","d10","emtiyaz","souratjalase"],"not_rendered":{"charts":0,"images":3,"macros":1,"external_links":0,"defined_names":27,"comments":0,"pivot_tables":0},"unopened":[],"bounds":{"document_bytes":16777216,"sheet_cells":100000,"rows_first":2000,"rows_last":500,"rows_between":2000,"halvings":0,"cell_chars":16384,"cell_head_chars":4096},"cells_cut":0,"cells_raw":0,"read":"whole","date_system":"1900"}

{"sheet":"param","index":0,"n_rows":195,"n_cols":42,"rows_kept":195,"cut":false,"hidden":false,"merged":[[77,0,77,1],[82,0,82,2],[89,0,89,2],[28,0,28,1],[35,0,35,1],[39,0,39,1],[46,0,46,2],[54,0,54,1],[67,0,67,1]]}
["مدرک تحصیلی","مرتبه درخواستی","مدرک مرتبه","حداقل میانگین ارزشیابی سه سال اخیر","توقف","سابقه","حداقل امتیاز","حداکثر امتیاز ذخیره","حداکثر امتیاز محور الف","حداکثر امتیاز محور الف 1","حداکثر امتیاز محور الف 2","حداکثر امتیاز محور الف 3","حداکثر امتیاز محور الف 4","حداقل امتیاز محور ب","حداکثر امتیاز محور ب","حداکثر امتیاز محور ب 1","حداکثر سال محور ب 1","امتیاز هر سال سابقه","حداکثر امتیاز محور ب 2","حداکثر امتیاز محور ب 3","حداقل امتیاز محور ج","حداکثر امتیاز محور ج","حداکثر امتیاز محور ج 1-1","حداکثر امتیاز محور ج 1-2","حداکثر امتیاز محور ج 2-1","حداکثر امتیاز محور ج 2-2","حداکثر امتیاز محور ج 3","حداکثر امتیاز محور ج 4","حداکثر امتیاز محور د","حداکثر امتیاز محور د 1","حداکثر امتیاز محور د 2","حداکثر امتیاز محور د 3","حداکثر امتیاز محور د 3 الف","حداکثر امتیاز محور د 3 ب","حداکثر امتیاز محور د 4","حداکثر امتیاز محور د 5","حداکثر امتیاز محور د 6","حداکثر امتیاز محور د 7","حداکثر امتیاز محور د 8","حداکثر امتیاز محور د 9","حداکثر امتیاز محور د 10","حداکثر"]
["دکتری یا سطح چهار حوزه","مقدماتی",{"$f":"A2&B2","v":"دکتری یا سطح چهار حوزهمقدماتی"},0,0,null,null,null,350,59,146,58,87,null,null,270,35,24,200,50,null,null,140,10,60,40,100,40,null,20,60,160,80,80,30,40,50,30,50,60,80,"---"]
["کارشناسی ارشد یا سطح سه حوزه","مقدماتی",{"$f":"A3&B3","v":"کارشناسی ارشد یا سطح سه حوزهمقدماتی"},0,0,null,null,null,280,46,117,47,70,null,null,270,35,20,200,50,null,null,140,10,60,40,100,30,null,20,60,160,80,80,30,40,50,30,50,60,80,"---"]
["کارشناسی یا سطح دو حوزه","مقدماتی","کارشناسی یا سطح دو حوزهمقدماتی",0,0,null,null,null,210,35,88,35,52,null,null,270,35,16,200,50,null,null,140,10,60,40,100,25,null,20,60,160,80,80,30,40,50,30,50,60,80,"---"]
["کاردانی یا سطح یک حوزه","مقدماتی","کاردانی یا سطح یک حوزهمقدماتی",0,0,null,null,null,140,25,55,25,35,null,null,270,35,12,200,50,null,null,140,10,60,40,100,15,null,20,60,160,80,80,30,40,50,30,50,60,80,"---"]
["دکتری یا سطح چهار حوزه","مهارتی","دکتری یا سطح چهار حوزهمهارتی",75,3,null,600,30,350,59,146,58,87,60,210,270,35,24,200,50,30,120,140,10,60,40,100,40,120,20,60,160,80,80,30,40,50,30,50,60,80,600]
{"$rows_left_out":190}
{"sheet":"komite","index":1,"n_rows":9,"n_cols":3,"rows_kept":9,"cut":false,"hidden":false,"merged":[]}
["رج","نام و نام خانوادگی","سمت"]
[{"$f":"ROW()-1","v":1},"ایوب پروینی","دبیر کمیته و مدیر امور اداری و پشتیبانی"]
[{"$f":"ROW()-1","v":2},"اسماعیل عبدالهاشمی","عضو کمیته"]
[3,null,"عضو کمیته"]
[4,"رمضان خوئینی","عضو کمیته"]
[5,"حمید نظری","عضو کمیته"]
{"$rows_left_out":4}
{"sheet":"Main","index":2,"n_rows":18,"n_cols":4,"rows_kept":18,"cut":false,"hidden":false,"merged":[[0,0,0,7],[4,0,5,7],[1,0,3,7]]}
["دانشگاه بین المللی امام خمینی (ره)"]
[{"$f":"param!C30","v":"ارتقای رتبه اعضای غیر هیأت علمی"}]
[]
[]
["مدیریت توسعه، نیروی انسانی و پشتیبانی"]
[]
{"$rows_left_out":13}
{"sheet":"resid","index":3,"n_rows":24,"n_cols":14,"rows_kept":24,"cut":false,"hidden":false,"merged":[]}
[null,"بسمه تعالی"]
[null,{"$f":"\"بدینوسیله گواهی می شود؛ فایل درخواست ارتقای «رتبه \"&rotbe!G5&\"»\"&IF(moshakhasat!F5=\"مرد\",\" جناب آقای \",\" سرکار خانم \")&moshakhasat!B5&\" \"&moshakhasat!C5&\"، دارای شماره پرسنلی \"&moshakhasat!G5&\"، در روز  \"&J_WEEKDAY(J_TODAY(),1)&\" مورخ  \"&LEFT(J_TODAY(),4)&\"/\"&MID(J_TODAY(),5,2)&\"/\"&RIGHT(J_TODAY(),2)&\"، تحویل اداره کارگزینی گردید.\"","v":"بدینوسیله گواهی می شود؛ فایل درخواست ارتقای «رتبه مهارتی» سرکار خانم  ، دارای شماره پرسنلی ، در روز  سه شنبه مورخ  1403/07/24، تحویل اداره کارگزینی گردید."}]
[null,{"$f":"N4&M4&L4&K4&J4&I4&H4&G4&F4&E4&D4&C4","v":"140307245314"}]
[null,"این رسید بدون شماره ده رقمی اعتبار ندارد",{"$f":"RANDBETWEEN(0,9)","v":4},{"$f":"RANDBETWEEN(0,9)","v":1},3,5,{"$f":"MID(J_TODAY(),8,1)","v":"4"},{"$f":"MID(J_TODAY(),7,1)","v":"2"},{"$f":"MID(J_TODAY(),6,1)","v":"7"},{"$f":"MID(J_TODAY(),5,1)","v":"0"},{"$f":"MID(J_TODAY(),4,1)","v":"3"},{"$f":"MID(J_TODAY(),3,1)","v":"0"},{"$f":"MID(J_TODAY(),2,1)","v":"4"},{"$f":"LEFT(J_TODAY(),1)","v":"1"}]
[]
[]
{"$rows_left_out":19}
{"sheet":"rahnama","index":4,"n_rows":43,"n_cols":2,"rows_kept":43,"cut":false,"hidden":false,"merged":[]}
[null,"راهنمای درخواست ارتقای رتبه اعضای غیر هیأت علمی"]
[null,"الف) نکات آیین نامه ای"]
["!","تاریخ ارتقاء به رتبه بالاتر می بایست بعد از  تاریخ «1399/01/01» باشد"]
["!","تاریخ ارتقاء به رتبه بالاتر، تاریخ صدور رسید توسط کارگزینی کارکنان، یا به عبارتی آخرین نسخه تکمیلی این فایل، است."]
["!","کلیه فعالیت های محور ج و د شما از تاریخ ارتقای رتبه فعلی شما تا تاریخی که شما تعیین می کنید، بررسی می شوند."]
["!","اگر تاکنون رتبه دریافت نکرداید کلیه فعالیت های محور ج و د از ابتدای خدمت شما تا تاریخی که تعیین می کنید، بررسی می شوند."]
{"$rows_left_out":38}
{"sheet":"moshakhasat","index":5,"n_rows":10,"n_cols":7,"rows_kept":10,"cut":false,"hidden":false,"merged":[[0,0,0,6],[1,0,1,6],[6,0,6,6],[8,0,8,6],[2,0,2,6]]}
[{"$f":"param!C29","v":"مدیریت اداری و پشتیبانی\nارتقای رتبه اعضای غیر هیأت علمی"}]
[]
["مشخصات متقاضی"]
["شماره ملی","نام","نام خانوادگی","ایثارگر","مشمول جوانی جمعیت","جنسیت","شماره پرسنلی"]
[null,null,null,"خیر","خیر"]
[]
{"$rows_left_out":5}
{"sheet":"tahsilat","index":6,"n_rows":18,"n_cols":6,"rows_kept":18,"cut":false,"hidden":false,"merged":[[2,0,2,3],[0,0,0,5],[1,0,1,5]]}
[{"$f":"param!C29","v":"مدیریت اداری و پشتیبانی\nارتقای رتبه اعضای غیر هیأت علمی"}]
[]
["مقاطع تحصیلی",null,null,null,null,"آخرین مقطع تحصیلی"]
["رج","مقطع تحصیلی","تاریخ اخذ مدرک تحصیلی","رشته تحصیلی",null,{"$f":"IF(C5>13000101,B5,IF(C6>13000101,B6,IF(C7>13000101,B7,IF(C8>13000101,B8,IF(C9>13000101,B9,B10)))))","v":0}]
[1,"دکتری یا سطح چهار حوزه"]
[2,"کارشناسی ارشد یا سطح سه حوزه",null,null,null,{"$f":"IF(moshakhasat!D5=\"بله\",\"مقطع تحصیلی محاسبه شده  برای ایثارگران در محور الف\",\"\")","v":""}]
{"$rows_left_out":13}
{"sheet":"sanavat","index":7,"n_rows":29,"n_cols":7,"rows_kept":29,"cut":false,"hidden":false,"merged":[[2,0,2,6],[0,0,0,6],[1,0,1,6]]}
[{"$f":"param!C29","v":"مدیریت اداری و پشتیبانی\nارتقای رتبه اعضای غیر هیأت علمی"}]
[]
["سنوات خدمتی"]
["رج","تاریخ شروع","تاریخ پایان","محل استخدام","نوع استخدام","مدرک تحصیلی","مدت (روز)"]
[null,null,null,null,null,null,{"$f":"IF(ISBLANK(B5),0,IF(ISBLANK(C5),+J_DIFF(B5,rotbe!$H$5),J_DIFF(B5,C5)))","v":0}]
[null,null,null,null,null,null,{"$f":"IF(ISBLANK(B6),0,IF(ISBLANK(C6),+J_DIFF(B6,rotbe!$H$5),J_DIFF(B6,C6)))","v":0}]
{"$rows_left_out":24}
{"sheet":"rotbe","index":8,"n_rows":22,"n_cols":9,"rows_kept":22,"cut":false,"hidden":false,"merged":[[6,0,6,7],[2,0,2,7],[0,0,0,7],[1,0,1,7],[5,0,5,7]]}
[{"$f":"param!C29","v":"مدیریت اداری و پشتیبانی\nارتقای رتبه اعضای غیر هیأت علمی"}]
[]
["میزان توقف در رتبه کنونی برای رتبه بالاتر (سال)"]
["توقف در رتبه کنونی (سال)","توقف مورد نیاز (سال)","سنوات خدمتی (سال)","سنوات خدمتی مورد نیاز","رتبه کنونی","تاریخ دریافت رتبه کنونی","رتبه درخواستی","تاریخ درخواست رتبه بالاتر"]
[{"$f":"IFERROR(J_DIFF(F5,H5)/365,\"\")","v":""},{"$f":"IF(OR(moshakhasat!$D$5=\"بله\",moshakhasat!$E$5=\"بله\"),B22-1,B22)","v":""},{"$f":"SUM('b1'!G:G)/365","v":0},{"$f":"IFERROR(VLOOKUP(tahsilat!$F$4&$G$5,param!$C$1:$AO$28,4,FALSE),\"\")","v":""},"مقدماتی",null,{"$f":"IFERROR(IF(tahsilat!F4=\"کاردانی یا سطح یک حوزه\",VLOOKUP(E5,param!A98:C101,3,FALSE),+VLOOKUP(E5,param!A98:B102,2,FALSE)),\"\")","v":"مهارتی"}]
[{"$f":"IF(F5>13000101,\"\",\"اگر تاکنون پرونده شما بررسی و رتبه بندی نشده است، در قسمت «تاریخ دریافت رتبه کنونی»، تاریخ آغاز خدمت دولتی خود را وارد نمایید.\")","v":"اگر تاکنون پرونده شما بررسی و رتبه بندی نشده است، در قسمت «تاریخ دریافت رتبه کنونی»، تاریخ آغاز خدمت دولتی خود را وارد نمایید."}]
{"$rows_left_out":17}
{"sheet":"arzeshyabi","index":9,"n_rows":6,"n_cols":5,"rows_kept":6,"cut":false,"hidden":false,"merged":[[2,0,2,4],[5,0,5,4],[0,0,0,4],[1,0,1,4]]}
[{"$f":"param!C29","v":"مدیریت اداری و پشتیبانی\nارتقای رتبه اعضای غیر هیأت علمی"}]
[]
["نمرات ارزشیابی سالیانه (سه سال اخیر)"]
[{"$f":"IFERROR(\"سال \"&LEFT(rotbe!H5,4)-3,\"\")","v":""},{"$f":"IFERROR(\"سال \"&LEFT(rotbe!H5,4)-2,\"\")","v":""},{"$f":"IFERROR(\"سال \"&LEFT(rotbe!H5,4)-1,\"\")","v":""},"میانگین","میانگین مورد نیاز"]
[null,null,null,{"$f":"IF(AND(A5>0,B5>0,C5>0),AVERAGE(A5:C5),0)","v":0},{"$f":"IFERROR(VLOOKUP(rotbe!G5,param!$B$2:$D$28,3,FALSE),\"\")","v":75}]
[{"$f":"IF(OR(AND(D5>0,D5=E5),AND(D5>0,D5>E5)),\"مجاز به ارسال درخواست می باشید\",\"مجاز به ارسال درخواست نمی باشید\")","v":"مجاز به ارسال درخواست نمی باشید"}]
{"$rows_left_out":1}
{"sheet":"a","index":10,"n_rows":8,"n_cols":10,"rows_kept":8,"cut":false,"hidden":false,"merged":[[0,0,0,9],[2,0,2,9],[5,1,5,2],[5,3,5,4],[5,5,5,7],[5,8,5,9],[4,0,4,9],[3,0,3,9],[1,0,1,9]]}
[{"$f":"param!C29","v":"مدیریت اداری و پشتیبانی\nارتقای رتبه اعضای غیر هیأت علمی"}]
[]
["محور الف: سوابق تحصیلی"]
[{"$f":"IFERROR(\"امتیاز متقاضی: \"&(C8+E8+H8+J8)&\"  | حداکثر امتیاز: \"&VLOOKUP(IF(moshakhasat!$D$5=\"بله\",tahsilat!$F$7,tahsilat!$F$4)&rotbe!$G$5,param!$C$2:$AO$28,7,FALSE)&\"  | امتیاز قابل محاسبه: \"&MIN((C8+E8+H8+J8),VLOOKUP(IF(moshakhasat!$D$5=\"بله\",tahsilat!$F$7,tahsilat!$F$4)&rotbe!$G$5,param!$C$2:$AO$28,7,FALSE)),\"\")","v":""}]
["آخرین مدرک تحصیلی"]
[null,"الف 1: مقطع تحصیلی",null,"الف 2: ارتباط مدرک تحصیلی",null,"الف 3: محل اخذ مدرک",null,null,"الف 4: معدل"]
{"$rows_left_out":3}
{"sheet":"b1","index":11,"n_rows":31,"n_cols":8,"rows_kept":31,"cut":false,"hidden":false,"merged":[[2,0,2,7],[0,0,0,7],[3,0,3,7],[1,0,1,7]]}
[{"$f":"param!C29","v":"مدیریت اداری و پشتیبانی\nارتقای رتبه اعضای غیر هیأت علمی"}]
[]
["ب1: سنوات خدمتی"]
[{"$f":"IFERROR(\"امتیاز متقاضی: \"&ROUND(SUM(H:H),2)-E5&\"  | حداکثر امتیاز: \"&VLOOKUP(tahsilat!$F$4&rotbe!$G$5,param!$C$2:$AO$28,14,FALSE)&\"  | امتیاز قابل محاسبه: \"&MIN(ROUND(SUM(H:H),2),VLOOKUP(tahsilat!$F$4&rotbe!$G$5,param!$C$2:$AO$28,14,FALSE)),\"\")","v":""}]
[null,null,null,"امتیاز منفی کسر کار (بدون حقوق، غیبت، تعلیق و ...):"]
["رج","تاریخ شروع","تاریخ پایان","محل استخدام","نوع استخدام","مدرک تحصیلی","مدت (روز)","امتیاز"]
{"$rows_left_out":26}
{"sheet":"b2","index":12,"n_rows":24,"n_cols":9,"rows_kept":24,"cut":false,"hidden":false,"merged":[[2,0,2,8],[3,0,3,8],[0,0,0,8],[1,0,1,8]]}
[{"$f":"param!C29","v":"مدیریت اداری و پشتیبانی\nارتقای رتبه اعضای غیر هیأت علمی"}]
[]
["ب 2: سوابق اجرایی، مدیریتی و سرپرستی"]
[{"$f":"IFERROR(\"امتیاز متقاضی: \"&ROUND(SUM(H$3:H$14),2)&\"  | حداکثر امتیاز: \"&VLOOKUP(tahsilat!$F$4&rotbe!$G$5,param!$C$2:$AO$28,17,FALSE)&\"  | امتیاز قابل محاسبه: \"&MIN(ROUND(SUM(H$3:H$14),2),VLOOKUP(tahsilat!$F$4&rotbe!$G$5,param!$C$2:$AO$28,17,FALSE)),\"\")","v":""}]
["ردیف","عنوان خدمت","سطح خدمت","تاریخ شروع","تاریخ پایان","شماره ابلاغ/ حکم","مقام امضاکننده/ ابلاغ کننده","امتیاز","مستند"]
[null,null,null,null,null,null,null,{"$f":"IFERROR(IF(A6>0,(J_DIFF(D6,IF(E6>13000101,E6,rotbe!$H$5)))*VLOOKUP(C6,param!$A$30:$B$34,2,FALSE)/365,\"\"),\"\")","v":""},{"$f":"IF(A6>0,\"B2_1\",\"\")","v":""}]
{"$rows_left_out":19}
{"sheet":"b3","index":13,"n_rows":25,"n_cols":7,"rows_kept":25,"cut":false,"hidden":false,"merged":[[2,0,2,6],[3,0,3,6],[0,0,0,6],[1,0,1,6]]}
[{"$f":"param!C29","v":"مدیریت اداری و پشتیبانی\nارتقای رتبه اعضای غیر هیأت علمی"}]
[]
["ب 3: عضویت در کمیته ها، شوراها"]
[{"$f":"IFERROR(\"امتیاز متقاضی: \"&ROUND(SUM(F$3:F$14),2)&\"  | حداکثر امتیاز: \"&VLOOKUP(tahsilat!$F$4&rotbe!$G$5,param!$C$2:$AO$28,18,FALSE)&\"  | امتیاز قابل محاسبه: \"&MIN(ROUND(SUM(F$3:F$14),2),VLOOKUP(tahsilat!$F$4&rotbe!$G$5,param!$C$2:$AO$28,18,FALSE)),\"\")","v":""}]
["ردیف","عنوان کمیته، هیأت، شورا","مقام ابلاغ کننده","تاریخ شروع","تاریخ پایان","امتیاز","مستند"]
[null,null,null,null,null,{"$f":"IFERROR(IF(A6>0,(J_DIFF(D6,IF(E6>13000101,E6,rotbe!$H$5)))*VLOOKUP(C6,param!$A$37:$B$38,2,FALSE)/365,\"\"),\"\")","v":""},{"$f":"IF(A6>0,\"B3_1\",\"\")","v":""}]
{"$rows_left_out":20}
{"sheet":"g1-1","index":14,"n_rows":6,"n_cols":6,"rows_kept":6,"cut":false,"hidden":false,"merged":[[7,0,7,5],[5,0,5,2],[2,0,2,5],[3,0,3,5],[0,0,0,5],[1,0,1,5],[4,0,4,2]]}
[{"$f":"param!C29","v":"مدیریت اداری و پشتیبانی\nارتقای رتبه اعضای غیر هیأت علمی"}]
[]
["ج 1-1: دوره های آموزشی"]
[{"$f":"IFERROR(\"امتیاز متقاضی: \"&ROUND(SUM(E:E),2)&\"  | حداکثر امتیاز: \"&VLOOKUP(tahsilat!$F$4&rotbe!$G$5,param!$C$2:$AO$28,21,FALSE)&\"  | امتیاز قابل محاسبه: \"&MIN(ROUND(SUM(E:E),2),VLOOKUP(tahsilat!$F$4&rotbe!$G$5,param!$C$2:$AO$28,21,FALSE)),\"\")","v":""}]
["عنوان",null,null,"ساعت","امتیاز","مستند"]
["مجموع کل ساعت های دوره های گذرانده شده و دوره های متفرقه را در ستون ساعت، درج نمایید.",null,null,null,{"$f":"IF(D6>0,D6/5,\"\")","v":""},{"$f":"IF(D6>0,\"G1-1_1\",\"\")","v":""}]
{"$rows_left_out":1}
{"sheet":"g1-2","index":15,"n_rows":44,"n_cols":4,"rows_kept":44,"cut":false,"hidden":false,"merged":[[2,0,2,3],[0,0,0,3],[3,0,3,3],[1,0,1,3]]}
[{"$f":"param!C29","v":"مدیریت اداری و پشتیبانی\nارتقای رتبه اعضای غیر هیأت علمی"}]
[]
["ج 1-2: شرکت در کارگاه ها و همایش های آموزشی"]
[{"$f":"IFERROR(\"امتیاز متقاضی: \"&ROUND(SUM(C:C),2)&\"  | حداکثر امتیاز: \"&VLOOKUP(tahsilat!$F$4&rotbe!$G$5,param!$C$2:$AO$28,22,FALSE)&\"  | امتیاز قابل محاسبه: \"&MIN(ROUND(SUM(C:C),2),VLOOKUP(tahsilat!$F$4&rotbe!$G$5,param!$C$2:$AO$28,22,FALSE)),\"\")","v":""}]
["ردیف","عنوان","امتیاز","مستند"]
[null,null,{"$f":"IF(A6>0,2,\"\")","v":""},{"$f":"IF(A6>0,\"G1-2_1\",\"\")","v":""}]
{"$rows_left_out":39}
{"sheet":"g2-1","index":16,"n_rows":9,"n_cols":4,"rows_kept":9,"cut":false,"hidden":false,"merged":[[7,0,7,3],[5,0,5,1],[0,0,0,3],[2,0,2,3],[3,0,3,3],[1,0,1,3],[4,0,4,1]]}
[{"$f":"param!C29","v":"مدیریت اداری و پشتیبانی\nارتقای رتبه اعضای غیر هیأت علمی"}]
[]
["ج 2-1: آموزش به همکاران"]
[{"$f":"IFERROR(\"امتیاز متقاضی: \"&IF(SUM('b1'!G7:G31)>2919,ROUND(C6,2),0)&\"  | حداکثر امتیاز: \"&VLOOKUP(tahsilat!$F$4&rotbe!$G$5,param!$C$2:$AO$28,23,FALSE)&\"  | امتیاز قابل محاسبه: \"&MIN(IF(SUM('b1'!G7:G31)>2919,ROUND(C6,2),0),VLOOKUP(tahsilat!$F$4&rotbe!$G$5,param!$C$2:$AO$28,23,FALSE)),\"\")","v":""}]
["نوع آموزش",null,"امتیاز","مستند"]
["امتیاز فرم آموزش به همکار که به تأیید اداره آموزش کارکنان رسانده اید را در ستون امتیاز، درج نمایید",null,null,{"$f":"IF(C6>0,\"G2-1\",\"\")","v":""}]
{"$rows_left_out":4}
{"sheet":"g2-2","index":17,"n_rows":25,"n_cols":4,"rows_kept":25,"cut":false,"hidden":false,"merged":[[2,0,2,3],[3,0,3,3],[0,0,0,3],[1,0,1,3]]}
[{"$f":"param!C29","v":"مدیریت اداری و پشتیبانی\nارتقای رتبه اعضای غیر هیأت علمی"}]
[]
["ج 2-2: تدریس به همکاران"]
[{"$f":"IFERROR(\"امتیاز متقاضی: \"&ROUND(SUM($C:$C),2)&\"  | حداکثر امتیاز: \"&VLOOKUP(tahsilat!$F$4&rotbe!$G$5,param!$C$2:$AO$28,24,FALSE)&\"  | امتیاز قابل محاسبه: \"&MIN(ROUND(SUM($C:$C),2),VLOOKUP(tahsilat!$F$4&rotbe!$G$5,param!$C$2:$AO$28,24,FALSE)),\"\")","v":""}]
["ردیف","عنوان دوره آموزش","امتیاز","مستند"]
[null,null,null,{"$f":"IF(A6>0,\"G2-2_1\",\"\")","v":""}]
{"$rows_left_out":20}
{"sheet":"g3","index":18,"n_rows":52,"n_cols":6,"rows_kept":52,"cut":false,"hidden":false,"merged":[[0,0,0,5],[2,0,2,5],[3,0,3,5],[1,0,1,5]]}
[{"$f":"param!C29","v":"مدیریت اداری و پشتیبانی\nارتقای رتبه اعضای غیر هیأت علمی"}]
[]
["ج 3: تسلط به نرم افزار"]
[{"$f":"IFERROR(\"امتیاز متقاضی: \"&ROUND(SUM(D:D),2)&\"  | حداکثر امتیاز: \"&VLOOKUP(tahsilat!$F$4&rotbe!$G$5,param!$C$2:$AO$28,25,FALSE)&\"  | امتیاز قابل محاسبه: \"&MIN(ROUND(SUM(D:D),2),VLOOKUP(tahsilat!$F$4&rotbe!$G$5,param!$C$2:$AO$28,25,FALSE)),\"\")","v":""}]
["رج","عنوان","نوع دوره","امتیاز","حداکثر امتیاز","مستند"]
[1,"مهارت اول: مفاهیم ابتدایی در فناوری اطلاعات","ICDL",null,3,{"$f":"IF(D6>0,\"G3_1\",\"\")","v":""}]
{"$rows_left_out":47}
{"sheet":"g4","index":19,"n_rows":7,"n_cols":4,"rows_kept":7,"cut":false,"hidden":false,"merged":[[0,0,0,3],[2,0,2,3],[3,0,3,3],[1,0,1,3]]}
[{"$f":"param!C29","v":"مدیریت اداری و پشتیبانی\nارتقای رتبه اعضای غیر هیأت علمی"}]
[]
["ج 4: تسلط به زبان خارجی"]
[{"$f":"IFERROR(\"امتیاز متقاضی: \"&MAX(IF(C7=\"بله\",50,0),VLOOKUP(tahsilat!F4,param!A2:AB6,28,FALSE))&\"  | حداکثر امتیاز: \"&50&\"  | امتیاز قابل محاسبه: \"&MAX(IF(C7=\"بله\",50,0),VLOOKUP(tahsilat!F4,param!A2:AB6,28,FALSE)),\"\")","v":""}]
["ردیف","شرح",null,"مستند"]
[1,"زبان خارجی خود را انتخاب کنید","انگلیسی",{"$f":"IF($C$6=\"سایر\",\"G4_1\",\"\")","v":""}]
{"$rows_left_out":2}
{"sheet":"d1","index":20,"n_rows":42,"n_cols":8,"rows_kept":42,"cut":false,"hidden":false,"merged":[[0,0,0,7],[2,0,2,7],[3,0,3,7],[1,0,1,7]]}
[{"$f":"param!C29","v":"مدیریت اداری و پشتیبانی\nارتقای رتبه اعضای غیر هیأت علمی"}]
[]
["د 1: ارائه پیشنهادات نو و ابتکاری"]
[{"$f":"IFERROR(\"امتیاز متقاضی: \"&ROUND(SUM(F:F),2)&\"  | حداکثر امتیاز: \"&VLOOKUP(tahsilat!$F$4&rotbe!$G$5,param!$C$2:$AO$28,28,FALSE)&\"  | امتیاز قابل محاسبه: \"&MIN(ROUND(SUM(F:F),2),VLOOKUP(tahsilat!$F$4&rotbe!$G$5,param!$C$2:$AO$28,28,FALSE)),\"\")","v":""}]
["ردیف","عنوان","سطح پیشنهاد","مرجع تصویب کننده","وضعیت اجرایی","امتیاز","حداکثر امتیاز","مستند"]
[null,null,null,null,null,null,{"$f":"IFERROR(IF(E6=\"مصوب و اجرا شده است\",+VLOOKUP(C6,param!$A$49:$C$53,3,FALSE),VLOOKUP(C6,param!$A$49:$C$53,2,FALSE)),\"\")","v":""},{"$f":"IF($A6>0,\"D1_1\",\"\")","v":""}]
{"$rows_left_out":37}
{"sheet":"d2","index":21,"n_rows":43,"n_cols":7,"rows_kept":43,"cut":false,"hidden":false,"merged":[[3,0,3,6],[0,0,0,6],[2,0,2,6],[1,0,1,6]]}
[{"$f":"param!C29","v":"مدیریت اداری و پشتیبانی\nارتقای رتبه اعضای غیر هیأت علمی"}]
[]
["د 2: فعالیت های پژوهشی"]
[{"$f":"IFERROR(\"امتیاز متقاضی: \"&ROUND(SUM(E:E),2)&\"  | حداکثر امتیاز: \"&VLOOKUP(tahsilat!$F$4&rotbe!$G$5,param!$C$2:$AO$28,29,FALSE)&\"  | امتیاز قابل محاسبه: \"&MIN(ROUND(SUM(E:E),2),VLOOKUP(tahsilat!$F$4&rotbe!$G$5,param!$C$2:$AO$28,29,FALSE)),\"\")","v":""}]
["ردیف","عنوان فعالیت","نوع فعالیت","محل ارائه یا چاپ","امتیاز","حداکثر امتیاز","مستند"]
[null,null,null,null,null,{"$f":"IFERROR(VLOOKUP(C6,param!$A$56:$B$66,2,FALSE),\"\")","v":""},{"$f":"IF($A6>0,\"D2_1\",\"\")","v":""}]
{"$rows_left_out":38}
{"sheet":"d3","index":22,"n_rows":38,"n_cols":7,"rows_kept":38,"cut":false,"hidden":false,"merged":[[4,0,4,6],[0,0,0,6],[2,0,2,6],[1,0,1,6],[3,0,3,6]]}
[{"$f":"param!C29","v":"مدیریت اداری و پشتیبانی\nارتقای رتبه اعضای غیر هیأت علمی"}]
[]
["د 3: ارائه گزارش های تحلیلی و عملکردی"]
["گزارش هایی قابل امتیازدهی هستند که: (1) دارای نامه اداری ثبت شده در سامانه اتوماسیون اداری باشد. یا (2) خروجی سامانه های اداری با دسترسی کاربری متقاضی باشد."]
[{"$f":"IFERROR(\"امتیاز متقاضی: \"&SUM(E$7:E$1048576)&\"  | حداکثر امتیاز: \"&VLOOKUP(tahsilat!$F$4&rotbe!$G$5,param!$C$2:$AO$27,30,FALSE)&\"  | امتیاز قابل محاسبه: \"&MIN(SUM(E$7:E$1048576),VLOOKUP(tahsilat!$F$4&rotbe!$G$5,param!$C$2:$AO$28,30,FALSE)),\"\")","v":""}]
["ردیف","عنوان فعالیت","نوع گزارش","ارائه شده به","امتیاز","حداکثر امتیاز","مستند"]
{"$rows_left_out":33}
{"sheet":"d4","index":23,"n_rows":33,"n_cols":7,"rows_kept":33,"cut":false,"hidden":false,"merged":[[4,0,4,6],[2,0,2,6],[0,0,0,6],[1,0,1,6],[3,0,3,6]]}
[{"$f":"param!C29","v":"مدیریت اداری و پشتیبانی\nارتقای رتبه اعضای غیر هیأت علمی"}]
[]
["د 4: دریافت لوح تقدیر و تشویق"]
["فقط تقدیرنامه های کاری درج شوند و از درج تقدیرنامه های مناسبتی خودداری نمایید."]
[{"$f":"IFERROR(\"امتیاز متقاضی: \"&SUM(F:F)&\"  | حداکثر امتیاز: \"&VLOOKUP(tahsilat!$F$4&rotbe!$G$5,param!$C$2:$AO$28,33,FALSE)&\"  | امتیاز قابل محاسبه: \"&MIN(SUM(F:F),VLOOKUP(tahsilat!$F$4&rotbe!$G$5,param!$C$2:$AO$28,33,FALSE)),\"\")","v":""}]
["ردیف","عنوان فعالیت","تاریخ","شماره","مقام امضاء کننده","امتیاز","مستند"]
{"$rows_left_out":28}
{"sheet":"d5","index":24,"n_rows":14,"n_cols":8,"rows_kept":14,"cut":false,"hidden":false,"merged":[[0,0,0,7],[2,0,2,7],[3,0,3,7],[1,0,1,7]]}
[{"$f":"param!C29","v":"مدیریت اداری و پشتیبانی\nارتقای رتبه اعضای غیر هیأت علمی"}]
[]
["د 5: کسب عنوان «کارمند یا مدیر نمونه»"]
[{"$f":"IFERROR(\"امتیاز متقاضی: \"&SUM(G:G)&\"  | حداکثر امتیاز: \"&VLOOKUP(tahsilat!$F$4&rotbe!$G$5,param!$C$2:$AO$28,34,FALSE)&\"  | امتیاز قابل محاسبه: \"&MIN(SUM(G:G),VLOOKUP(tahsilat!$F$4&rotbe!$G$5,param!$C$2:$AO$28,34,FALSE)),\"\")","v":""}]
["ردیف","کارمند نمونه/ مدیر نمونه","سطح انتخاب","سال انتخاب","تاریخ","شماره","امتیاز","مستند"]
[null,null,null,null,null,null,{"$f":"IFERROR(VLOOKUP(C6,param!$A$79:$B$81,2,FALSE),\"\")","v":""},{"$f":"IF($A6>0,\"D5_1\",\"\")","v":""}]
{"$rows_left_out":9}
{"sheet":"d8","index":25,"n_rows":45,"n_cols":9,"rows_kept":45,"cut":false,"hidden":false,"merged":[[2,0,2,8],[3,0,3,8],[0,0,0,8],[1,0,1,8]]}
[{"$f":"param!C29","v":"مدیریت اداری و پشتیبانی\nارتقای رتبه اعضای غیر هیأت علمی"}]
[]
["د 8: تدوین یا بازنگری آیین نامه ها، دستورالعمل ها و مجموعه مقررات جاری"]
[{"$f":"IFERROR(\"امتیاز متقاضی: \"&SUM(G:G)&\"  | حداکثر امتیاز: \"&VLOOKUP(tahsilat!$F$4&rotbe!$G$5,param!$C$2:$AO$28,37,FALSE)&\"  | امتیاز قابل محاسبه: \"&MIN(SUM(G:G),VLOOKUP(tahsilat!$F$4&rotbe!$G$5,param!$C$2:$AO$28,37,FALSE)),\"\")","v":""}]
["ردیف","عنوان","تاریخ","شماره","سطح اجرایی","تدوین یا بازنگری","امتیاز","حداکثر امتیاز","مستند"]
[null,null,null,null,null,null,null,{"$f":"IFERROR(IF(F6=\"تدوین\",+VLOOKUP(E6,param!$A$85:$C$88,2,FALSE),+VLOOKUP(E6,param!$A$85:$C$88,3,FALSE)),\"\")","v":""},{"$f":"IF($A6>0,\"D8_1\",\"\")","v":""}]
{"$rows_left_out":40}
{"sheet":"d9","index":26,"n_rows":41,"n_cols":10,"rows_kept":41,"cut":false,"hidden":false,"merged":[[0,0,0,9],[2,0,2,9],[4,0,4,9],[1,0,1,9],[3,0,3,9]]}
[{"$f":"param!C29","v":"مدیریت اداری و پشتیبانی\nارتقای رتبه اعضای غیر هیأت علمی"}]
[]
["د 9: احصای فرآیندها و اصلاح روش های انجام کار"]
["فرآیندهای احصاء، تدوین یا اصلاح شده باید به تأیید کارشناس کارگروه بهبود فرآیندهای دانشگاه رسیده باشد."]
[{"$f":"IFERROR(\"امتیاز متقاضی: \"&SUM(H:H)&\"  | حداکثر امتیاز: \"&VLOOKUP(tahsilat!$F$4&rotbe!$G$5,param!$C$2:$AO$28,38,FALSE)&\"  | امتیاز قابل محاسبه: \"&MIN(SUM(H:H),VLOOKUP(tahsilat!$F$4&rotbe!$G$5,param!$C$2:$AO$28,38,FALSE)),\"\")","v":""}]
["ردیف","عنوان","تاریخ","شماره","سطح اجرایی","مالک/ مجری","احصاء، و تدوین/ اصلاح","امتیاز","حداکثر امتیاز","مستند"]
{"$rows_left_out":36}
{"sheet":"d10","index":27,"n_rows":46,"n_cols":6,"rows_kept":46,"cut":false,"hidden":false,"merged":[[2,0,2,5],[4,0,4,5],[0,0,0,5],[1,0,1,5],[5,2,5,3],[3,0,3,5],[6,2,6,3],[7,2,7,3],[8,2,8,3],[9,2,9,3],[10,2,10,3],[11,2,11,3],[12,2,12,3],[13,2,13,3],[14,2,14,3],[15,2,15,3],[16,2,16,3],[17,2,17,3],[18,2,18,3],[19,2,19,3],[20,2,20,3],[21,2,21,3],[22,2,22,3],[23,2,23,3],[24,2,24,3],[25,2,25,3],[26,2,26,3],[27,2,27,3],[28,2,28,3],[29,2,29,3],[30,2,30,3],[31,2,31,3],[32,2,32,3],[33,2,33,3],[34,2,34,3],[35,2,35,3],[36,2,36,3],[37,2,37,3],[38,2,38,3],[39,2,39,3],[40,2,40,3],[41,2,41,3],[42,2,42,3],[43,2,43,3],[44,2,44,3],[45,2,45,3]]}
[{"$f":"param!C29","v":"مدیریت اداری و پشتیبانی\nارتقای رتبه اعضای غیر هیأت علمی"}]
[]
["د 10: مستندسازی فعالیت ها و تجربیات"]
["مستندی که بعد از شما، شخص جایگزین پست سازمانی شما، با مراجعه به آن، توانایی کامل و بی نقص انجام وظایف پست سازمانی را داشته باشد. این مستند باید؛ (1) دارای فهرست و شماره صفحات باشد. (2) شامل کلیه آیین نامه، دستورالعمل ها و ... دانشگاهی یا وزراتی مورد استفاده در پست سازمانی شما باشد. (3) شامل نحوه به کارگیری سامانه های آنلاین و نرم افزارها باشد."]
[{"$f":"IFERROR(\"امتیاز متقاضی: \"&SUM(E:E)&\"  | حداکثر امتیاز: \"&VLOOKUP(tahsilat!$F$4&rotbe!$G$5,param!$C$2:$AO$28,39,FALSE)&\"  | امتیاز قابل محاسبه: \"&MIN(SUM(E:E),VLOOKUP(tahsilat!$F$4&rotbe!$G$5,param!$C$2:$AO$28,39,FALSE)),\"\")","v":""}]
["ردیف","عنوان","الکترونیکی/ کاغذی",null,"امتیاز","مستند"]
{"$rows_left_out":41}
{"sheet":"emtiyaz","index":28,"n_rows":48,"n_cols":6,"rows_kept":48,"cut":false,"hidden":false,"merged":[[0,0,0,5],[44,0,44,5],[6,0,7,0],[1,0,1,5],[7,1,7,3],[7,4,7,5],[10,0,10,5],[8,0,8,5],[4,1,4,5],[9,0,9,5],[2,1,2,2],[3,1,3,2],[45,4,45,5],[46,4,46,5],[47,4,47,5],[47,2,47,3],[45,0,45,1],[46,0,46,1],[47,0,47,1],[46,2,46,3],[45,2,45,3]]}
[{"$f":"param!C29","v":"مدیریت اداری و پشتیبانی\nارتقای رتبه اعضای غیر هیأت علمی"}]
[]
["نام","نام خانوادگی",null,"رتبه درخواستی","سابقه","شماره پرسنلی"]
[{"$f":"moshakhasat!B5","v":0},{"$f":"moshakhasat!C5","v":0},null,{"$f":"rotbe!G5","v":"مهارتی"},{"$f":"IFERROR(ROUNDDOWN(SUM(sanavat!$G:$G)/365,0)&\" سال و \"&ROUNDDOWN((((SUM(sanavat!$G:$G)/365)-LEFT(SUM(sanavat!$G:$G)/365,(SEARCH(\".\",SUM(sanavat!$G:$G)/365))-1))*365)/30,0)&\" ماه\",0)","v":0},{"$f":"moshakhasat!G5","v":0}]
[{"$f":"moshakhasat!B5&\" \"&moshakhasat!C5","v":" "},"مجموع امتیازات"]
[null,"امتیاز کسب شده","حداقل امتیاز","حداکثر امتیاز","امتیاز نهایی",{"$f":"IF(rotbe!$G$5=\"یک\",\"\",\"امتیاز ذخیره\")","v":"امتیاز ذخیره"}]
{"$rows_left_out":43}
{"sheet":"souratjalase","index":29,"n_rows":49,"n_cols":8,"rows_kept":49,"cut":false,"hidden":false,"merged":[[41,0,41,7],[16,6,16,7],[31,0,31,2],[32,0,32,2],[17,0,17,2],[35,0,35,2],[26,0,26,2],[27,0,27,2],[28,0,28,2],[29,0,29,2],[30,0,30,2],[37,5,37,7],[38,5,38,7],[39,5,39,7],[39,3,39,4],[37,3,37,4],[47,1,48,1],[9,0,9,2],[10,0,10,2],[11,0,11,2],[12,0,12,2],[13,0,13,2],[45,2,45,3],[39,0,39,2],[40,0,40,7],[42,0,42,7],[36,0,36,7],[37,0,37,2],[38,0,38,2],[14,0,14,2],[43,2,43,3],[44,2,44,3],[15,6,15,7],[8,6,8,7],[9,6,9,7],[10,6,10,7],[11,6,11,7],[12,6,12,7],[13,6,13,7],[14,6,14,7],[38,3,38,4],[8,0,8,2],[34,0,34,2],[33,0,33,2],[18,0,18,2],[19,0,19,2],[20,0,20,2],[24,0,24,2],[25,0,25,2],[15,0,15,2],[16,0,16,2],[21,0,21,2],[22,0,22,2],[23,0,23,2],[0,0,1,0],[1,1,1,6],[3,0,3,1],[2,2,2,4],[3,2,3,4],[0,1,0,6],[2,0,2,1],[4,0,4,7],[7,3,7,5],[7,6,7,7],[5,0,5,2],[6,0,7,2],[6,6,6,7]]}
[null,{"$f":"param!C29","v":"مدیریت اداری و پشتیبانی\nارتقای رتبه اعضای غیر هیأت علمی"},null,null,null,null,null,"تاریخ"]
[null,"صورتجلسه امتیازدهی",null,null,null,null,null,14030701]
["نام",null,"نام خانوادگی",null,null,"رتبه درخواستی","سابقه","شماره پرسنلی"]
[{"$f":"moshakhasat!B5","v":0},null,{"$f":"moshakhasat!C5","v":0},null,null,{"$f":"rotbe!G5","v":"مهارتی"},{"$f":"IFERROR(ROUNDDOWN(SUM(sanavat!$G:$G)/365,0)&\" سال و \"&ROUNDDOWN((((SUM(sanavat!$G:$G)/365)-LEFT(SUM(sanavat!$G:$G)/365,(SEARCH(\".\",SUM(sanavat!$G:$G)/365))-1))*365)/30,0)&\" ماه\",0)","v":0},{"$f":"moshakhasat!G5","v":0}]
[{"$f":"emtiyaz!B5","v":"مجموع امتیازات"}]
[null,null,null,{"$f":"emtiyaz!B6","v":"امتیاز کسب شده"},{"$f":"emtiyaz!C6","v":"حداقل امتیاز"},{"$f":"emtiyaz!D6","v":"حداکثر امتیاز"},{"$f":"emtiyaz!E6","v":"امتیاز نهایی"},{"$f":"emtiyaz!F6","v":"امتیاز ذخیره"}]
{"$rows_left_out":43}